Jump to content

gameboy

Community Members
  • Posts

    1.684
  • Joined

  • Last visited

  • Days Won

    4

gameboy last won the day on December 21 2019

gameboy had the most liked content!

2 Followers

Profile Information

  • Gender
    Male

Recent Profile Visitors

The recent visitors block is disabled and is not being shown to other users.

gameboy's Achievements

Primus Pilus

Primus Pilus (7/14)

186

Reputation

3

Community Answers

  1. Yes, this error does exist, and you'll notice it when you rotate the camera. We need to fix this problem by modifying the code in the file I uploaded.
  2. Up to this point everything was fine on the system Windows, but when the file made a lot of changes, the problem occurred.
  3. @Stan` I have uploaded this file, which is an earlier version, and my friend and I have modified it, which effectively solves this problem. But for the file with the same name in the current version, you need to further modify it, and I think he( @vladislavbelov ) can do it. TerrainRenderer.cpp
  4. @Stan` I'll provide a document and maybe he can help him ( @vladislavbelov )solve the problem.
  5. Okay, Stan, but I think he can fix it. This problem has been bothering us for over a year.
  6. I tested the latest SVN26164 again today, and I still saw flickering bands in the game. @Stan` @vladislavbelov
  7. @Stan` I have lost the file, I have supplemented the missing file with SVN, the compilation is successful!
  8. @Stan` Please tell me, where is the log file?
  9. @Stan` 18>Generating test_TerritoryManager.cpp 18>Generating test_scripts.cpp 18>Generating test_CmpTemplateManager.cpp 18>Generating test_ComponentManager.cpp 18>Generating test_EntityMap.cpp 18>Generating test_ParamNode.cpp 18>Generating test_SerializeTemplates.cpp 18>Generating test_Serializer.cpp 18>Generating test_Simulation2.cpp 18>Generating test_pkcs5_pbkdf5.cpp 18>Generating test_Preprocessor.cpp 18>precompiled.cpp 17>LINK : fatal error LNK1181: cannot open input file 'D:\trunk\binaries\system\engine.lib' 17>Done building project "pyrogenesis.vcxproj" -- FAILED. 18>test_CLogger.cpp 18>test_CStr.cpp 18>test_ConfigDB.cpp 18>test_Future.cpp 18>test_Hashing.cpp 18>test_Hotkeys.cpp 18>test_Mod.cpp 18>test_ModIo.cpp 18>test_TaskManager.cpp 18>test_fmt.cpp 18>test_test.cpp 18>test_FunctionWrapper.cpp 18>test_ScriptConversions.cpp 18>test_ScriptInterface.cpp 18>test_CinemaManager.cpp 18>test_CommandQueue.cpp 18>test_HierPathfinder.cpp 18>test_ObstructionManager.cpp 18>test_Pathfinder.cpp 18>test_Position.cpp 18>test_RangeManager.cpp 18>test_TerritoryManager.cpp 18>test_scripts.cpp 18>test_CmpTemplateManager.cpp 18>test_ComponentManager.cpp 18>test_EntityMap.cpp 18>test_ParamNode.cpp 18>test_SerializeTemplates.cpp 18>test_Serializer.cpp 18>test_Simulation2.cpp 18>test_root.cpp 18>test_setup.cpp 18>test_pkcs5_pbkdf5.cpp 18>test_Preprocessor.cpp 18>LINK : fatal error LNK1181: cannot open input file 'D:\trunk\binaries\system\engine.lib' 18>Done building project "test.vcxproj" -- FAILED. ========== Build: 15 succeeded, 3 failed, 0 up-to-date, 0 skipped ==========
  10. @vladislavbelov Yes,But the error message still appears.
  11. Today, I tested the latest svn26161. I compiled the game program using vs2017, and the compilation failed: 18>LINK : fatal error LNK1181: cannot open input file 'D:\trunk\binaries\system\engine.lib' 18>Done building project "test.vcxproj" -- FAILED. ========== Build: 14 succeeded, 4 failed, 0 up-to-date, 0 skipped ========== I cleaned up the solution and tried to compile again, but it failed.
  12. Can this patch be officially released? The Maurya dynasty building elephant needs to regain this ability. Thank you for your help, I hope to see it in SVN, I will test it, thank you again.
  13. Can you restore the function of an elephant?
  14. I tested the latest svn26003 and found that the elephant supporting the construction of the building could not help the workers complete the construction of the building. It lost its construction ability.
×
×
  • Create New...